Sf_category,Sf_framecode,Entry_ID,Sf_ID,ID,BMRB_code,Name,Type,Polymer_common_type,Polymer_type,Polymer_type_details,Polymer_strand_ID,Polymer_seq_one_letter_code_can,Polymer_seq_one_letter_code,Target_identifier,Polymer_author_defined_seq,Polymer_author_seq_details,Ambiguous_conformational_states,Ambiguous_chem_comp_sites,Nstd_monomer,Nstd_chirality,Nstd_linkage,Nonpolymer_comp_ID,Nonpolymer_comp_label,Number_of_monomers,Number_of_nonpolymer_components,Paramagnetic,Thiol_state,Src_method,Parent_entity_ID,Fragment,Mutation,EC_number,Calc_isoelectric_point,Formula_weight,Formula_weight_exptl,Formula_weight_exptl_meth,Details,DB_query_date,DB_query_revised_last_date
entity,ZN,10176,3595,2,,ZN,non-polymer,,,,,,,,,,,,,,,ZN,chem_comp_ZN,,,,,,2,,,,,,,,,,
entity,ZN,10201,4141,2,,ZN,non-polymer,,,,,,,,,,,,,,,ZN,chem_comp_ZN,,,,,,2,,,,,,,,,,
entity,NGH,15120,22855,4,,NGH,non-polymer,,,,,,,,,,,,,,,NGH,,,,,,,4,,,,,,,,,,
entity,entity_ZN,19540,107544,3,ZN,entity ZN,non-polymer,,,,,,,,,,,,,,,ZN,chem_comp_ZN,,1,,,,3,,,,,65.409,,,,,
entity,entity_CYC,19629,109268,2,CYC,PHYCOCYANOBILIN,non-polymer,,,,,,,,,,,,,,,CYC,chem_comp_CYC,,1,,,,2,,,,,588.694,,,,,
entity,entity_HEC,19638,109387,2,HEC,entity HEC,non-polymer,,,,,,,,,,,,,,,HEC,chem_comp_HEC,,1,,,,2,,,,,618.503,,,,,
entity,entity_ZN,19771,111750,2,ZN,ZINC ION,non-polymer,,,,,,,,,,,,,,,ZN,chem_comp_ZN,,1,,,,2,,,,,65.409,,,,,
entity,entity_CA,19789,112022,3,CA,CALCIUM ION,non-polymer,,,,,,,,,,,,,,,CA,chem_comp_CA,,1,,,,3,,,,,40.078,,,,,
entity,entity_ZN,19986,115192,2,ZN,ZINC ION,non-polymer,,,,,,,,,,,,,,,,,,1,,,,2,,,,,65.409,,,,,
entity,parathyroid_hormone,2234,120123,1,,parathyroid hormone,polymer,,polypeptide(L),,,,AFWFYH,,,,,,,,,,,6,,,,,,,,,,,,,,,
entity,entity_CA,25136,123727,2,CA,entity CA,non-polymer,,,,,,,,,,,,,,,CA,chem_comp_CA,,1,,,,2,,,,,40.078,,,,,
entity,entity_ZN,25145,123879,2,ZN,ZINC ION,non-polymer,,,,,,,,,,,,,,,ZN,chem_comp_ZN,,1,,,,2,,,,,65.409,,,,,
entity,entity_ZN,25229,125395,2,ZN,entity ZN,non-polymer,,,,,,,,,,,,,,,ZN,chem_comp_ZN,,1,,,,2,,,,,65.409,,,,,
entity,entity_HEC,25418,128718,2,HEC,HEME C,non-polymer,,,,,,,,,,,,,,,HEC,chem_comp_HEC,,1,,,,,,,,,618.503,,,,,
entity,entity_FOL,11556,17637,2,FOL,FOLIC ACID,non-polymer,,,,,,,,,,,,,,,FOL,chem_comp_FOL,,1,,,,,,,,,441.397,,,,,
entity,ZN,15059,21734,2,,ZN,non-polymer,,,,,,,,,,no,no,,no,no,ZN,chem_comp_ZN,,,,,,2,,,,,,,,,,
entity,entity_ZN,50626,238145,2,ZN,entity ZN,non-polymer,,,,,,,,,,,,,,,ZN,chem_comp_ZN,,1,,,,2,,,,,65.409,,,,,
entity,CA,15296,26112,3,,CA,non-polymer,,,,,,,,,,,,,,,CA,,,,,,,,,,,,,,,,,
entity,CA,15594,31847,2,,CA,non-polymer,,,,,,,,,,no,no,,no,no,CA,,,,,,,2,,,,,,,,,,
entity,CA,5071,239485,3,,CA,non-polymer,,,,,,,,,,no,no,,no,no,CA,chem_comp_CA,,,,,,3,,,,,,,,,,
entity,CA,15909,38284,2,,CA,non-polymer,,,,,,,,,,no,no,,no,no,CA,chem_comp_CA,,,,,,2,,,,,,,,,,
entity,entity_ZN,51104,245597,2,ZN,entity ZN,non-polymer,,,,,,,,,,,,,,,ZN,chem_comp_ZN,,1,,,,2,,,,,65.409,,,,,
entity,entity_PCG,51201,247309,2,PCG,entity PCG,non-polymer,,,,,,,,,,,,,,,PCG,chem_comp_PCG,,1,,,,2,,,,,345.205,,,,,
entity,PNS,16860,56540,2,,PNS,non-polymer,,,,,,,,,,no,no,,no,no,PNS,chem_comp_PNS,,,no,not present,,2,,,,,,,,,,
entity,PBU,16889,57136,2,,PBU,non-polymer,,,,,,,,,,no,no,,no,no,PBU,chem_comp_PBU,,,,,,2,,,,,,,,,,
entity,PTR,17100,61387,2,,PTR,non-polymer,,,,,,,,,,no,no,,no,no,PTR,chem_comp_PTR,,,,,,2,,,,,,,,,,
entity,CD,17294,65214,2,,CD,non-polymer,,,,,,,,,,no,no,,no,no,CD,chem_comp_CD,,,,,,2,,,,,,,,,,
entity,ZN,5147,251633,2,,ZN,non-polymer,,,,,,,,,,no,no,,no,no,ZN,chem_comp_ZN,,,,,,2,,,,,,,,,,
entity,ZN,5163,254030,2,,ZN,non-polymer,,,,,,,,,,no,no,,no,no,ZN,chem_comp_ZN,,,,,,2,,,,,,,,,,
entity,ZN,17386,66877,2,,ZN,non-polymer,,,,,,,,,,no,no,,no,no,ZN,chem_comp_ZN,,,,,,2,,,,,,,,,,
entity,entity_HEC,971,306919,2,HEC,HEME C,non-polymer,,,,,,,,,,,,,,,HEC,chem_comp_HEC,,1,,,,2,,,,,618.503,,,,,
entity,ZN,17680,72500,2,,ZN,non-polymer,,,,,,,,,,no,no,,no,no,ZN,chem_comp_ZN,,,,,,2,,,,,,,,,,
entity,UQ8,17710,73105,4,,UQ8,non-polymer,,,,,,,,,,no,no,,no,no,UQ8,chem_comp_UQ8,,,,,,4,,,,,,,,,,
entity,ZN,10309,6299,2,,ZN,non-polymer,,,,,,,,,,no,no,,no,no,ZN,chem_comp_ZN,,,,,,2,,,,,,,,,,
entity,ZN,16025,40323,2,,ZN,non-polymer,,,,,,,,,,no,no,,no,no,ZN,chem_comp_ZN,,,,,,2,,,,,,,,,,
entity,OLA,16048,40730,2,,OLA,non-polymer,,,,,,,,,,no,no,,no,no,OLA,chem_comp_OLA,,,,,,2,,,,,,,,,,
entity,HC4,18122,81086,2,,HC4,non-polymer,,,,,,,,,,no,no,,no,no,HC4,chem_comp_HC4,,,,,,2,,,,,,,,,,
entity,PO4,16759,54644,2,,PO4,non-polymer,,,,,,,,,,no,no,,no,no,PO4,chem_comp_PO4,,,,,,2,,,,,,,,,,
entity,gp120,1887,95313,1,,gp120,polymer,,polypeptide(L),,,,IHIGPGRAFYTX,,,,,,,,,,,12,,,,,1,,,,,,,,,2005-11-24,2001-05-09
entity,entity_1RG,18911,96179,2,1RG,entity 1RG,non-polymer,,,,,,,,,,,,,,,1RG,chem_comp_1RG,,1,,,,2,,,,,477.531,,,,,
entity,entity_ZN,18955,97005,2,ZN,entity ZN,non-polymer,,,,,,,,,,,,,,,ZN,chem_comp_ZN,,1,,,,2,,,,,65.409,,,,,
entity,entity_ZN,19047,98644,2,ZN,ZINC ION,non-polymer,,,,,,,,,,,,,,,ZN,chem_comp_ZN,,1,no,not present,,2,,,,,65.409,,,,,
entity,entity_ZN,19074,99158,3,ZN,ZINC ION,non-polymer,,,,,,,,,,,,,,,,,,1,,,,3,,,,,65.409,,,,,
entity,conotoxin,19102,99593,1,,entity,polymer,,polypeptide(L),,A,,CCRLACGLGCHXCCX,,,,no,no,yes,no,no,,,15,,no,,man,,,,,,1454.814,,,,,
entity,entity_ZN,19236,102107,2,ZN,entity ZN,non-polymer,,,,,,,,,,,,,,,ZN,chem_comp_ZN,,1,,,,2,,,,,65.409,,,,,
entity,entity_CA,19283,102980,2,CA,CALCIUM ION,non-polymer,,,,,,,,,,,,,,,,,,1,,,,2,,,,,40.078,,,,,
entity,entity_CA,19604,108795,3,CA,CALCIUM ION,non-polymer,,,,,,,,,,,,,,,,,,1,,,,3,,,,,40.078,,,,,
entity,entity_CPS,26757,145147,4,CPS,entity CPS,non-polymer,,,,,,,,,,,,,,,CPS,chem_comp_CPS,,1,,,,4,,,,,614.877,,,,,
entity,entity_ZN,19716,110727,2,ZN,ZINC ION,non-polymer,,,,,,,,,,,,,,,ZN,chem_comp_ZN,,1,,,,2,,,,,65.409,,,,,
entity,entity_ZN,25376,128026,2,ZN,entity ZN,non-polymer,,,,,,,,,,,,,,,ZN,chem_comp_ZN,,1,,,,2,,,,,65.409,,,,,
entity,entity_ZN,25575,131647,2,ZN,ZINC ION,non-polymer,,,,,,,,,,,,,,,ZN,chem_comp_ZN,,1,,,,2,,,,,65.409,,,,,
entity,entity_CA,25797,135595,2,CA,CALCIUM ION,non-polymer,,,,,,,,,,,,,,,CA,chem_comp_CA,,1,,,,,,,,,40.078,,,,,
entity,entity_CA,25810,135884,2,CA,entity CA,non-polymer,,,,,,,,,,,,,,,CA,chem_comp_CA,,1,,,,2,,,,,40.078,,,,,
entity,entity_CA,25974,138741,5654,CA,CALCIUM ION,non-polymer,,,,,,,,,,,,,,,,,,1,,,,,,,,,40.078,,,,,
entity,DNA_dCGAC,26620,143013,2,,DNA dCGAC,polymer,,polydeoxyribonucleotide,,,,CGAC,,,,no,no,no,no,no,,,4,,no,not present,,,,,,,,,,,,
entity,entity_ZN,26691,144043,2,ZN,entity ZN,non-polymer,,,,,,,,,,,,,,,ZN,chem_comp_ZN,,1,,,,2,,,,,65.409,,,,,
entity,entity_ZN,27043,149781,2,ZN,entity ZN,non-polymer,,,,,,,,,,,,,,,ZN,chem_comp_ZN,,1,,,,2,,,,,65.409,,,,,
entity,entity_MG,26777,145490,2,MG,entity MG,non-polymer,,,,,,,,,,,,,,,MG,chem_comp_MG,,1,,,,2,,,,,24.305,,,,,
entity,entity_BEF,26777,145491,3,BEF,entity BEF,non-polymer,,,,,,,,,,,,,,,BEF,chem_comp_BEF,,1,,,,3,,,,,66.007,,,,,
entity,entity_CA,27787,161630,5654,CA,CALCIUM ION,non-polymer,,,,,,,,,,,,,,,CA,chem_comp_CA,,1,,,,,,,,,40.078,,,,,
entity,C1305,27829,162275,2,,C1305,non-polymer,,,,,,X,,,,no,no,no,no,no,,,1,,no,not present,,,,,,,,,,,,
entity,entity_CA,28050,165599,2,CA,entity CA,non-polymer,,,,,,,,,,,,,,,CA,chem_comp_CA,,1,,,,2,,,,,40.078,,,,,
entity,entity_MG,28095,166292,2,MG,MAGNESIUM ION,non-polymer,,,,,,,,,,,,,,,MG,chem_comp_MG,,1,,,,2,,,,,24.305,,,,,
entity,entity_CA,30305,173225,3,CA,CALCIUM ION,non-polymer,,,,,,,,,,,,,,,CA,chem_comp_CA,,1,,,,3,,,,,40.078,,,,,
entity,entity_2VN,30478,176515,2,2VN,entity 2VN,non-polymer,,,,,,,,,,,,,,,2VN,chem_comp_2VN,,1,,,,2,,,,,502.752,,,,,
entity,entity_YT3,30515,177268,2,YT3,entity YT3,non-polymer,,,,,,,,,,,,,,,YT3,chem_comp_YT3,,1,,,,2,,,,,88.906,,,,,
entity,entity_ZN,31038,187337,3,ZN,entity ZN,non-polymer,,,,,,,,,,,,,,,ZN,chem_comp_ZN,,1,,,,3,,,,,65.409,,,,,
entity,entity_K,34431,197091,2,K,entity K,non-polymer,,,,,,,,,,,,,,,K,chem_comp_K,,1,,,,2,,,,,39.098,,,,,
entity,entity_1,34371,195925,1,,entity 1,polymer,,polypeptide(L),,A,,XLSLCA,,,,,,yes,,no,,,6,,,,syn,1,,,,,576.707,,,,,
entity,entity_CA,34496,198340,2,CA,entity CA,non-polymer,,,,,,,,,,,,,,,CA,chem_comp_CA,,1,,,,2,,,,,40.078,,,,,
entity,entity_CA,34608,200462,3,CA,entity CA,non-polymer,,,,,,,,,,,,,,,CA,chem_comp_CA,,1,,,,3,,,,,40.078,,,,,
entity,CU1,4019,208881,2,,CU1,non-polymer,,,,,,,,,,no,no,,no,no,CU1,chem_comp_CU1,,,,,,2,,,,,,,,,,
entity,entity_ULW,34608,200463,4,,entity ULW,non-polymer,,,,,,,,,,,,,,,,,,,,,syn,4,,,,,377.518,,,,,
entity,ZN,4249,212981,2,,ZN,non-polymer,,,,,,,,,,no,no,,no,no,ZN,chem_comp_ZN,,,,,,2,,,,,,,,,,
entity,ZN,4382,215728,2,,ZN,non-polymer,,,,,,,,,,no,no,,no,no,ZN,chem_comp_ZN,,,,,,2,,,,,,,,,,
entity,entity_HEM,25551,131187,4,HEM,PROTOPORPHYRIN IX CONTAINING FE,non-polymer,,,,,,,,,,,,,,,HEM,chem_comp_HEM,,1,,,,,,,,,616.487,,,,,
entity,entity_ZN,25707,133953,3,ZN,ZINC ION,non-polymer,,,,,,,,,,,,,,,ZN,chem_comp_ZN,,1,,,,,,,,,65.409,,,,,
entity,ZN,4571,219178,2,,ZN,non-polymer,,,,,,,,,,no,no,,no,no,ZN,chem_comp_ZN,,,,,,2,,,,,,,,,,
entity,ZN,4621,220127,2,,ZN,non-polymer,,,,,,,,,,no,no,,no,no,ZN,chem_comp_ZN,,,,,,2,,,,,,,,,,
entity,G4R,4169,211367,1,,pyoverdin G4R,polymer,,polypeptide(L),,,,XDXXXGSXX,,,,,,,,,,,9,,,not present,,1,,,,,,,,,,
entity,entity_FES,26301,140776,2,FES,FE2/S2 (INORGANIC) CLUSTER,non-polymer,,,,,,,,,,,,,,,FES,chem_comp_FES,,1,,,,,,,,,175.820,,,,,
entity,ZN,4928,226360,2,,ZN,non-polymer,,,,,,,,,,no,no,,no,no,ZN,chem_comp_ZN,,,,,,2,,,,,,,,,,
entity,entity_CA,26571,142279,2,CA,entity CA,non-polymer,,,,,,,,,,,,,,,CA,chem_comp_CA,,1,,,,2,,,,,40.078,,,,,
entity,entity_CA,26685,143937,2,CA,entity CA,non-polymer,,,,,,,,,,,,,,,CA,chem_comp_CA,,1,,,,2,,,,,40.078,,,,,
entity,entity_CA,26721,144589,2,CA,entity CA,non-polymer,,,,,,,,,,,,,,,CA,chem_comp_CA,,1,,,,2,,,,,40.078,,,,,
entity,entity_ZN,26741,144879,2,ZN,entity ZN,non-polymer,,,,,,,,,,,,,,,ZN,chem_comp_ZN,,1,,,,2,,,,,65.409,,,,,
entity,entity_AP5,27004,149145,2,AP5,entity AP5,non-polymer,,,,,,,,,,,,,,,AP5,chem_comp_AP5,,1,,,,2,,,,,916.367,,,,,
entity,entity_FMN,27470,156622,2,FMN,entity FMN,non-polymer,,,,,,,,,,,,,,,FMN,chem_comp_FMN,,1,,,,2,,,,,456.344,,,,,
entity,entity_CA,30063,168747,3,CA,CALCIUM ION,non-polymer,,,,,,,,,,,,,,,,,,1,,,,3,,,,,40.078,,,,,
entity,entity_ZN,28019,165092,2,ZN,ZINC ION,non-polymer,,,,,,,,,,,,,,,,,,1,,,,2,,,,,65.409,,,,,
entity,entity_GA,28057,165718,2,GA,entity GA,non-polymer,,,,,,,,,,,,,,,GA,chem_comp_GA,,1,,,,2,,,,,69.723,,,,,
entity,entity_Z90,28118,166673,2,Z90,entity Z90,non-polymer,,,,,,,,,,,,,,,Z90,chem_comp_Z90,,1,,,,2,,,,,565.699,,,,,
entity,entity_HEC,285,167066,2,HEC,HEME C,non-polymer,,,,,,,,,,,,,,,HEC,chem_comp_HEC,,1,,,,2,,,,,618.503,,,,,
entity,entity_ZN,30002,167630,2,ZN,ZINC ION,non-polymer,,,,,,,,,,,,,,,ZN,chem_comp_ZN,,1,,,,2,,,,,65.409,,,,,
entity,entity_1,30227,171892,1,,entity 1,polymer,,polypeptide(L),,A-Y,,IHVHLQI,,,,,,no,,no,,,7,,no,not present,syn,1,,,,,861.042,,,,,
entity,entity_B0I,30333,173797,2,B0I,entity B0I,non-polymer,,,,,,,,,,,,,,,B0I,chem_comp_B0I,,1,,,,2,,,,,182.261,,,,,
entity,entity_ZN,30491,176770,2,ZN,entity ZN,non-polymer,,,,,,,,,,,,,,,ZN,chem_comp_ZN,,1,,,,2,,,,,65.409,,,,,
entity,entity_CA,51447,251264,2,CA,entity CA,non-polymer,,,,,,,,,,,,,,,CA,chem_comp_CA,,1,,,,2,,,,,40.078,,,,,
entity,entity_MG,30639,179546,7,MG,MAGNESIUM ION,non-polymer,,,,,,,,,,,,,,,MG,chem_comp_MG,,1,,,,,,,,,24.305,,,,,
entity,CA,5156,252926,2,,CA,non-polymer,,,,,,,,,,no,no,,no,no,CA,chem_comp_CA,,,,,,2,,,,,,,,,,
entity,entity_HEC,317,188637,2,HEC,HEME C,non-polymer,,,,,,,,,,,,,,,HEC,chem_comp_HEC,,1,,,,2,,,,,618.503,,,,,
entity,entity_NH2,34075,190296,2,NH2,entity NH2,non-polymer,,,,,,,,,,,,,,,NH2,chem_comp_NH2,,1,,,,2,,,,,16.023,,,,,
entity,entity_1,34632,200890,1,,entity 1,polymer,,polypeptide(L),,A,,FVPWFSKFXGRILX,,,,,,yes,,no,,,14,,no,not present,syn,1,,,,,1609.976,,,,,
entity,entity_O1F,34746,202989,2,,entity O1F,non-polymer,,,,,,,,,,,,,,,,,,,,,syn,2,,,,,297.350,,,,,
entity,trp_repressor,393,208712,1,,trp repressor,polymer,,polypeptide(L),,,,AQQSPY,,,,,,,,,,,6,,,,,,,,,,,,,,,
entity,WW7,4056,209433,2,,WW7,non-polymer,,,,,,,,,,no,no,,no,no,WW7,chem_comp_WW7,,,,,,2,,,,,,,,,,
entity,CA,4129,210636,3,,CA,non-polymer,,,,,,,,,,no,no,,no,no,CA,chem_comp_CA,,,,,,3,,,,,,,,,,
entity,ZN,4153,211064,2,,ZN,non-polymer,,,,,,,,,,no,no,,no,no,ZN,chem_comp_ZN,,,,,,2,,,,,,,,,,
entity,ZN,5525,268129,2,,ZN,non-polymer,,,,,,,,,,no,no,,no,no,ZN,chem_comp_ZN,,,,,,2,,,,,,,,,,
entity,entity_SF4,4229,212558,2,SF4,IRON/SULFUR CLUSTER,non-polymer,,,,,,,,,,,,,,,SF4,chem_comp_SF4,,1,,,,,,,,,351.640,,,,,
entity,HEM,5802,274538,2,,HEM,non-polymer,,,,,,,,,,no,no,,no,no,HEM,chem_comp_HEM,,,,,,2,,,,,,,,,,
entity,BLM,5870,276118,1,,BLEOMYCIN A2,non-polymer,,,,,,,,,,no,no,,,,BLM,chem_comp_BLM,1,,no,,,1,,,,,,,,,,
entity,CA,5895,276715,2,,CA,non-polymer,,,,,,,,,,no,no,,no,no,CA,chem_comp_CA,,,,,,2,,,,,,,,,,
entity,ZN,6005,279295,3,,ZN,non-polymer,,,,,,,,,,no,no,,no,no,ZN,chem_comp_ZN,,,,,,3,,,,,,,,,,
entity,CA,4378,215633,2,,CA,non-polymer,,,,,,,,,,no,no,,no,no,CA,chem_comp_CA,,,,,,2,,,,,,,,,,
entity,S3P,4848,224590,2,,shikimate-3-phosphate,non-polymer,,,,,,,,,,no,no,,,,,chem_comp_S3P,1,,no,,,,,,,,,,,,,
entity,CA,6103,281331,2,,CA,non-polymer,,,,,,,,,,no,no,,no,no,CA,chem_comp_CA,,,,,,2,,,,,,,,,,
entity,ZN,4925,226295,2,,ZN,non-polymer,,,,,,,,,,no,no,,no,no,ZN,chem_comp_ZN,,,,,,2,,,,,,,,,,
entity,entity_GA,50636,238322,2,GA,entity GA,non-polymer,,,,,,,,,,,,,,,GA,chem_comp_GA,,1,,,,2,,,,,69.723,,,,,
entity,HEC,5026,232194,2,,HEC,non-polymer,,,,,,,,,,no,no,,no,no,HEC,chem_comp_HEC,,,,,,2,,,,,,,,,,
entity,entity_ZN,50405,234411,2,ZN,entity ZN,non-polymer,,,,,,,,,,,,,,,ZN,chem_comp_ZN,,1,,,,2,,,,,65.409,,,,,
entity,entity_FMN,50476,235747,2,FMN,entity FMN,non-polymer,,,,,,,,,,,,,,,FMN,chem_comp_FMN,,1,no,,,2,,,,,456.344,,,,,
entity,ZN,15333,26691,2,,ZN,non-polymer,,,,,,,,,,,,,,,ZN,chem_comp_ZN,,,,,,2,,,,,,,,,,
entity,CA,15561,31186,2,,CA,non-polymer,,,,,,,,,,no,no,,no,no,CA,,,,,,,,,,,,,,,,,
entity,MTN,15774,35264,2,,MTN,non-polymer,,,,,,,,,,no,no,,no,no,MTN,,,,,,,,,,,,,,,,,
entity,ZN,6845,296009,2,,ZN,non-polymer,,,,,,,,,,no,no,,no,no,ZN,chem_comp_ZN,,,,,,2,,,,,,,,,,
entity,ZN,15948,39018,2,,ZN,non-polymer,,,,,,,,,,no,no,,no,no,ZN,chem_comp_ZN,,,,,,2,,,,,,,,,,
entity,TH3,16419,47797,2,,TH3,non-polymer,,,,,,,,,,no,no,,no,no,TH3,chem_comp_TH3,,,,,,2,,,,,,,,,,
entity,ZN,17157,62473,2,,ZN,non-polymer,,,,,,,,,,no,no,,no,no,ZN,chem_comp_ZN,,,,,,2,,,,,,,,,,
entity,ZN,17710,73104,3,,ZN,non-polymer,,,,,,,,,,no,no,,no,no,ZN,chem_comp_ZN,,,,,,3,,,,,,,,,,
entity,CA,7190,301564,2,,CA,non-polymer,,,,,,,,,,no,no,,no,no,CA,chem_comp_CA,,,,,,,,,,,,,,,,
entity,GNP,17785,74617,2,,GNP,non-polymer,,,,,,,,,,no,no,,no,no,GNP,chem_comp_GNP,,,,,,2,,,,,,,,,,
entity,ZN,17824,75332,2,,ZN,non-polymer,,,,,,,,,,no,no,,no,no,ZN,chem_comp_ZN,,,,,,2,,,,,,,,,,
entity,entity_ZN,18526,88474,2,ZN,ZINC ION,non-polymer,,,,,,,,,,,,,,,ZN,chem_comp_ZN,,1,,,,,,,,,65.409,,,,,
entity,ZN,17228,63886,2,,ZN,non-polymer,,,,,,,,,,no,no,,no,no,ZN,chem_comp_ZN,,,no,,,2,,,,,,,,,,
entity,ZN,17229,63905,3,,ZN,non-polymer,,,,,,,,,,no,no,,no,no,ZN,chem_comp_ZN,,,no,not present,,3,,,,,,,,,,
entity,entity_DAL,19183,101055,2,19183,D-ALANINE,non-polymer,,,,,,,,,,,,,,,DAL,chem_comp_DAL,,1,,,,2,,,,,89.093,,,,,
entity,entity_ZN,19442,105765,2,ZN,ZINC ION,non-polymer,,,,,,,,,,,,,,,,,,1,,,,2,,,,,65.409,,,,,
entity,CA,9500,306697,2,,CA,non-polymer,,,,,,,,,,,,,,,CA,chem_comp_CA,,,,,,2,,,,,,,,,,
entity,ZN,11287,12719,2,,ZN,non-polymer,,,,,,,,,,no,no,,no,no,ZN,chem_comp_ZN,,,,,,2,,,,,,,,,,
entity,ZN,11393,14842,2,,ZN,non-polymer,,,,,,,,,,no,no,,no,no,ZN,chem_comp_ZN,,,,,,2,,,,,,,,,,
entity,entity_ZN,11476,16163,2,ZN,ZINC ION,non-polymer,,,,,,,,,,,,,,,ZN,chem_comp_ZN,,1,,,,,,,,,65.409,,,,,
entity,entity_1,51691,254816,1,,entity 1,polymer,,polypeptide(L),,,,SGQKGKQQTESKGSFSIQY,,,,no,no,no,no,no,,,19,,no,not present,,1,,,,,,,,,,
entity,entity_ZN,52158,260616,2,ZN,entity ZN,non-polymer,,,,,,,,,,,,,,,ZN,chem_comp_ZN,,1,,,,2,,,,,65.409,,,,,
entity,BEP,5386,265184,3,,BEP,non-polymer,,,,,,,,,,no,no,,no,no,BEP,chem_comp_BEP,,,,,,3,,,,,,,,,,
entity,entity_ZN,52210,261014,2,ZN,entity ZN,non-polymer,,,,,,,,,,,,,,,ZN,chem_comp_ZN,,1,,,,2,,,,,65.409,,,,,
entity,FES,5337,264188,2,,FES,non-polymer,,,,,,,,,,no,no,,no,no,FES,chem_comp_FES,,,,,,2,,,,,,,,,,
entity,U6_snRNA,5703,272402,1,,U6 snRNA,polymer,,polyribonucleotide,,,,GGUUCCCCUGCAUAAGGAXGAACC,,,,,,,,,,,24,,,not present,,1,,,,,,,,,,
entity,HEM,5759,273578,2,,HEM,non-polymer,,,,,,,,,,no,no,,no,no,HEM,chem_comp_HEM,,,,,,2,,,,,,,,,,
entity,CA,5961,278186,2,,CA,non-polymer,,,,,,,,,,no,no,,no,no,CA,chem_comp_CA,,,,,,2,,,,,,,,,,
entity,ZN,6289,284986,2,,ZN,non-polymer,,,,,,,,,,no,no,,no,no,ZN,chem_comp_ZN,,,,,,2,,,,,,,,,,
entity,ZN,6302,285320,2,,ZN,non-polymer,,,,,,,,,,no,no,,no,no,ZN,chem_comp_ZN,,,,,,2,,,,,,,,,,
entity,CA,6507,289587,2,,CA,non-polymer,,,,,,,,,,no,no,,no,no,CA,chem_comp_CA,,,,,,2,,,,,,,,,,
entity,NDP,5741,273191,3,,NDP,non-polymer,,,,,,,,,,no,no,,no,no,NDP,chem_comp_NDP,,,,,,3,,,,,,,,,,
entity,8OG,5866,276031,2,,8OG,non-polymer,,,,,,,,,,no,no,,no,no,8OG,chem_comp_8OG,,,,,,2,,,,,,,,,,
entity,MG,5866,276032,3,,MG,non-polymer,,,,,,,,,,no,no,,no,no,MG,chem_comp_MG,,,,,,3,,,,,,,,,,
entity,GSPT1_eRF3a,10019,372,1,,PAM2-1,polymer,,polypeptide(L),,,,AFSRQLNVNAKPFVPNVHA,,,,no,no,no,no,no,,,19,,no,not present,,,,,,,,,,,,2015-11-26
entity,collagen,1723,63922,1,,collagen,polymer,,polypeptide(L),,,GVKGDKGNPGWPGAPY,GVKGDKGNPGWPGAPY,,,,,,,,,,,16,,,,,1,,,,,,,,,,2015-11-25
entity,GATA-1_C-tail,17270,64705,2,,GATA-1 C-tail,polymer,,polypeptide(L),,B,,KASGXGKXLRGSN,,,,no,no,yes,no,no,,,13,,no,all free,man,2,,,,,,,,,,
entity,entity_FUC,18724,92445,2,FUC,ALPHA-L-FUCOSE,non-polymer,,,,,,,,,,,,,,,FUC,chem_comp_FUC,,1,no,not present,,2,,,,,164.156,,,,,
entity,DSV,6391,287128,2,,DSV,non-polymer,,,,,,,,,,no,no,,no,no,DSV,chem_comp_DSV,,,,,,2,,,,,,,,,,
entity,insulin_A_chain,1000,4,1,,insulin A chain,polymer,,polypeptide(L),,,GIVEQCCTSICSLYQLENYCN,GIVEQCCTSICSLYQLENYCN,,,,,,,,,,,21,,,,,1,,,,,,,,,,2015-11-26
entity,MP-X,10001,19,1,,MP-X,polymer,,polypeptide(L),,,,INWKGIAAMAKKLX,,,,no,no,yes,no,no,,,14,,no,not present,,,,,,,1556,,,,,
entity,F-spondin_TSR4,10002,37,1,,F-spondin TSR 4,polymer,,polypeptide(L),,,,GSIPCLLSPWSEWSDCSVTCGKGMRTRQRMLKSLAELGDCNEDLEQAEKCMLPECP,,,,no,no,no,no,no,,,56,,no,all disulfide bound,,,,,,,,,,,,2015-11-26
entity,RNA_lig_like,10004,50,1,,2'-5' RNA ligase-like protein,polymer,,polypeptide(L),,,,MRAFIAIDVSESVRDALVRAQDYIGSKEAKIKFVERENFHITLKFLGEITEEQAEEIKKILEKIAKKYKKHEVNVRGIGVFPNPNYVRVIWAGVENDEIIKKIAKEIDDELAKLGFKKEGNFVAHITLGRVKFVKDKLGLAMKLKELANEDFGSFIVEAIELKKSTLTPKGPIYETLARFELSEHHHHHH,,,,no,no,no,no,no,,,190,,no,not present,,,,,,,21793,,,,,2015-11-26
entity,ChBD_peptide,10005,75,1,,ChitinaseC chitin binding domain,polymer,,polypeptide(L),,,,MATCATAWSSSSVYTNGGTVSYNGRNYTAKWWTQNERPGTSDVWADKGACGTGS,,,,no,no,no,no,no,,,54,,no,all disulfide bound,,,,,,,5741,,,,,2015-11-26
entity,FN3_domain,10006,104,1,,FN3 domain,polymer,,polypeptide(L),,,,GSSGSSGMEPHKVVPLSKPHPPVVGKVTHHSIELYWDLEQKEKRQGPQEQWLRFSIEEEDPKMHSYGVIYTGYATRHVVEGLEPRTLYKFRLKVTSPSGEYEYSPVVSVATTRESGPSSG,,,,no,no,no,no,no,,,120,,no,all free,,,,,,,13500.288,,,,,2015-11-26
entity,FN3_domain,10008,123,1,,FN3 domain,polymer,,polypeptide(L),,,,GSSGSSGPGAPSTVRISKNVDGIHLSWEPPTSPSGNILEYSAYLAIRTAQMQDNPSQLVFMRIYCGLKTSCTVTAGQLANAHIDYTSRPAIVFRISAKNEKGYGPATQIRWLQGNSKSGPSSG,,,,no,no,no,no,no,,,123,,no,all free,,,,,,,13038.744,,,,,2015-11-26
entity,SH3_domain,10009,142,1,,SH3 domain,polymer,,polypeptide(L),,,,GSSGSSGSTMTVIKDYYALKENEICVSQGEVVQVLAVNQQNMCLVYQPASDHSPAAEGWVPGSILAPFSGPSSG,,,,no,no,no,no,no,,,74,,no,all free,,,,,,,7641.529,,,,,2015-11-26
entity,insulin_B_chain,1001,161,1,,insulin B chain,polymer,,polypeptide(L),,,FVNQHLCGDHLVEALYLVCGERGFFYEPKT,FVNQHLCGDHLVEALYLVCGERGFFYEPKT,,,,,,,,,,,30,,,,,1,,,,,,,,,,2015-11-26
entity,BLG_A34C,10010,178,1,,BLG A34C,polymer,,polypeptide(L),,,EAEAYVTQTMKGLDIQKVAGTWYSLAMAASDISLLDCQSAPLRVYVEELKPTPEGDLEILLQKWENDECAQKKIIAEKTKIPAVFKIDALNENKVLVLDTDYKKYLLFCMENSAEPEQSLVCQCLVRTPEVDDEALEKFDKALKALPMHIRLSFNPTQLEEQCHI,EAEAYVTQTMKGLDIQKVAGTWYSLAMAASDISLLDCQSAPLRVYVEELKPTPEGDLEILLQKWENDECAQKKIIAEKTKIPAVFKIDALNENKVLVLDTDYKKYLLFCMENSAEPEQSLVCQCLVRTPEVDDEALEKFDKALKALPMHIRLSFNPTQLEEQCHI,,,"The first three residues are signal sequence necessary for the expression.
The native sequence numbering starts at the forth residue.
-3 EAE -1  
1   AYVTQ TMKGL DIQKV AGTWY  20  
21  SLAMA ASDIS LLDAQ SAPLR  40  
41  VYVEE LKPTP EGDLE ILLQK  60  
61  WENDE CAQKK IIAEK TKIPA  80  
81  VFKID ALNEN KVLVL DTDYK 100  
101 KYLLF CMENS AEPEQ SLVCQ 120  
121 CLVRT PEVDD EALEK FDKAL 140  
141 KALPM HIRLS FNPTQ LEEQC 160  
161 HI 162",no,no,no,no,no,,,165,,no,free and bound,,1,,,,,18400,,,,,2015-11-26
entity,SWIRM_domain,10011,196,1,,SWIRM domain,polymer,,polypeptide(L),,,,GSSGSSGEEPSGVEGAAFQSRLPHDRMTSQEAACFPDIISGPQQTQKVFLFIRNRTLQLWLDNPKIQLTFEATLQQLEAPYNSDTVLVHRVHSYLERHGLINFGIYKRIKPLPTKKTGSGPSSG,,,,no,no,no,no,no,,,124,,no,all free,,,,,,,13710.63,,,,,2015-11-26
entity,TnI,10012,216,1,,TnI,polymer,,polypeptide(L),,,,KVNMDLRANLKQVKKEDTEKEKDLRDVGDWRKNIEEKSGMEGRKKMFEAGES,,,,no,no,no,no,no,,,52,,no,not present,,,,,,,,,,,,2015-11-26
entity,RING_Finger_Domain,10013,234,1,,RING Finger Domain,polymer,,polypeptide(L),,,,GSSGSSGPREPVVNDEMCDVCEVWTAESLFPCRVCTRVFHDGCLRRMGYIQGDSAAEVTEMAHTETGWSCHYCDNINLLLTEESGPSSG,,,,no,no,no,no,no,,,89,,no,all other bound,,,,,,,9688.757,,,,,2015-11-26
entity,ZN,10013,235,2,,ZN,non-polymer,,,,,,,,,,no,no,,no,no,ZN,chem_comp_ZN,,,,,,,,,,,,,,,,
entity,SRP_RNA_fragment,10014,255,1,,pfHE6-12,polymer,,polyribonucleotide,,,,GGCUGAAGGGCC,,,,no,no,no,no,no,,,12,,no,not present,,,,,,,,,,,,
entity,HIV-1_integrase,10015,275,1,,Y15A,polymer,,polypeptide(L),,,,FLDGIDKAQEEHEKAHSNWRAMASDFNLPPVVAKEIVASCDKCQLKGEAMHGQVD,,,,no,no,no,no,no,,,55,,no,all other bound,,,,,,,,,,,,2015-11-26
entity,ZN,10015,276,2,,ZN,non-polymer,,,,,,,,,,no,no,,no,no,ZN,chem_comp_ZN,,,,,,,,,,,,,,,,
entity,ABCB6-C,10016,299,1,,the C-terminal nucleotide-binding domain of the human mitochondrial ABC transporter ABCB6,polymer,,polypeptide(L),,,,FIDMENMFDLLKEETEVKDLPGAGPLRFQKGRIEFENVHFSYADGRETLQDVSFTVMPGQTLALVGPSGAGKSTILRLLFRFYDISSGCIRIDGQDISQVTQASLRSHIGVVPQDTVLFNDTIADNIRYGRVTAGNDEVEAAAQAAGIHDAIMAFPEGYRTQVGERGLKLSGGEKQRVAIARTILKAPGIILLDEATSALDTSNERAIQASLAKVCANRTTIVVAHRLSTVVNADQILVIKDGCIVERGRHEALLSRGGVYADMWQLQQGQEETSEDTKPQTMER,,,residues from Phe558 to the C-terminal Arg842,no,no,no,no,no,,,285,,no,all free,,,,,,,,,,,,2015-11-26
entity,ABCB6-C,10017,323,1,,"the C-terminal nucleotide-binding domain of the human mitochondrial ABC
transporter ABCB6",polymer,,polypeptide(L),,,,FIDMENMFDLLKEETEVKDLPGAGPLRFQKGRIEFENVHFSYADGRETLQDVSFTVMPGQTLALVGPSGAGKSTILRLLFRFYDISSGCIRIDGQDISQVTQASLRSHIGVVPQDTVLFNDTIADNIRYGRVTAGNDEVEAAAQAAGIHDAIMAFPEGYRTQVGERGLKLSGGEKQRVAIARTILKAPGIILLDEATSALDTSNERAIQASLAKVCANRTTIVVAHRLSTVVNADQILVIKDGCIVERGRHEALLSRGGVYADMWQLQQGQEETSEDTKPQTMER,,,residues from Phe558 to the C-terminal Arg842,no,no,no,no,no,,,285,,no,all free,,,,,,,,,,,,2015-11-26
entity,ADP,10017,324,2,,ADP,non-polymer,,,,,,,,,,no,no,,no,no,ADP,chem_comp_ADP,,,,,,,,,,,,,,,,
entity,LINE36,10018,349,1,,LINE36,polymer,,polyribonucleotide,,,,GGUUGUACGUCGCUUUGGAUAAAAGCGUCUGCGACC,,,,no,no,no,no,no,,,36,,no,not present,,,,,,,,,,,,
entity,polyA-binding_protein,10019,373,2,,PABC domain,polymer,,polypeptide(L),,,,GQEPLTASMLASAPPQEQKQMLGERLFPLIQAMHPTLAGKITGMLLEIDNSELLHMLESPESLRSKVDEAVAVLQAHQAKEAA,,,,no,no,no,no,no,,,83,,no,not present,,,,,,,,,,,,
entity,insulin_A_chain,1002,397,1,,insulin A chain,polymer,,polypeptide(L),,,GIVEQCCTSICSLYQLENYCN,GIVEQCCTSICSLYQLENYCN,,,,,,,,,,,21,,,,,1,,,,,,,,,,2015-11-26
entity,subunit_c,10021,411,1,,subunit c,polymer,,polypeptide(L),,,,MENLNMDLLYMAAAVMMGLAAIGAAIGIGILGGKFLEGAARQPDLIPLLRTQFFIVMGLVDAIPMIAVGLGLYVMFAVA,,,,no,no,no,no,no,,,79,,no,not present,,,,,,,,,,,,2015-11-26
entity,K3_peptide_of_beta2-m,10022,432,1,,amyloid protofibrils of beta2-microglobulin fragment,polymer,,polypeptide(L),,,,SNFLNCYVSGFHPSDIEVDLLK,,,,no,no,no,no,no,,,22,,no,all free,,,,,,,,,,,,2015-11-26